Target
Casein kinase II subunit alpha
Ligand
BDBM7458
Substrate
CK-2 Peptide Substrate
Meas. Tech.
Kinase Inhibition Assay
pH
7.5±n/a
Temperature
295.15±n/a K
Ki
740±n/a nM
Citation
 Sarno, Sde Moliner, ERuzzene, MPagano, MABattistutta, RBain, JFabbro, DSchoepfer, JElliott, MFuret, PMeggio, FZanotti, GPinna, LA Biochemical and three-dimensional-structural study of the specific inhibition of protein kinase CK2 by [5-oxo-5,6-dihydroindolo-(1,2-a)quinazolin-7-yl]acetic acid (IQA). Biochem J 374:639-46 (2003)  
Target
Name:
Casein kinase II subunit alpha
Synonyms:
CK II CK2- alpha CSK21_HUMAN Casein kinase 2 Casein kinase II alpha/beta Casein kinase II subunit alpha (CK2A1) Casein kinase II subunit alpha (CK2a V66A) Casein kinase II subunit alpha (CK2a)
Type:
Enzyme
Mol. Mass.:
45151.12
Organism:
Homo sapiens (Human)
Description:
P68400
Residue:
391
  
Inhibitor
Name:
BDBM7458
Synonyms:
5,7-dihydroxy-2-(4-hydroxyphenyl)-4H-chromen-4-one Apigenin Apigenin (3) Apigenin, 13 Naringenin, 18 US11337935, Compound Apigenin cid_5280443 | jm5b01461, Compound 90
Type:
Small organic molecule
Emp. Form.:
C15H10O5
Mol. Mass.:
270.2369
SMILES:
Oc1ccc(cc1)-c1cc(=O)c2c(O)cc(O)cc2o1
:
Substrate
Name:
CK-2 Peptide Substrate
Synonyms:
Type:
Peptide
Mol. Mass.:
1446.31
Organism:
Description:
Residue:
12
RRRADDSDDDDD