Target
Prostaglandin G/H synthase 1
Ligand
BDBM50153378
Substrate
Meas. Tech.
In Vitro COX Assay
IC50
0.010±n/a nM
Citation
 De Vivo, MScarpelli, RCavalli, AMigliore, MPiomelli, DHabrant, DFavia, A Multitarget FAAH and COX inhibitors and therapeutical uses thereof US Patent  US9630914 Publication Date 4/25/2017 
Target
Name:
Prostaglandin G/H synthase 1
Synonyms:
COX1 Cyclooxygenase-1 (COX-1) PTGS1 | Prostaglandin G/H synthase (cyclooxygenase)
Type:
Protein
Mol. Mass.:
68868.60
Organism:
Ovis aries (Sheep)
Description:
Residue:
600
  
Inhibitor
Name:
BDBM50153378
Synonyms:
CHEMBL3775041 | US9630914, Compound 12
Type:
Small organic molecule
Emp. Form.:
C22H26FNO4
Mol. Mass.:
387.4445
SMILES:
CCCCCCNC(=O)Oc1cccc(c1)-c1ccc(cc1F)C(C)C(O)=O
: