Target
Retinoid isomerohydrolase
Ligand
BDBM323454
Substrate
Meas. Tech.
In Vitro Isomerase Inhibition Assay
IC50
55.0±n/a nM
Citation
 Scott, ILKuksa, VAOrme, MWLittle, Jr., TLGall, AHong, F Alkoxy compounds for disease treatment US Patent  US10188615 Publication Date 1/29/2019 
Target
Name:
Retinoid isomerohydrolase
Synonyms:
Lutein isomerase RPE65 Retinal pigment epithelium-specific 65 kDa protein | Retinoid isomerohydrolase
Type:
Enzyme Catalytic Domain
Mol. Mass.:
60946.29
Organism:
Homo sapiens (Human)
Description:
Q16518
Residue:
533
  
Inhibitor
Name:
BDBM323454
Synonyms:
2-(3-(Isopentyloxy)Phenoxy)Ethanamine US10639286, Example 46
Type:
Small organic molecule
Emp. Form.:
C13H21NO2
Mol. Mass.:
223.3113
SMILES:
CC(C)CCOc1cccc(OCCN)c1
: