Target
5'-AMP-activated protein kinase catalytic subunit alpha-2
Ligand
BDBM327871
Substrate
Meas. Tech.
Enzyme-Linked Immunosorbent Assay
EC50
<500±n/a nM
Citation
 Irving, MShaw, S AMPK-activating heterocyclic compounds and methods for using the same US Patent  US9663496 Publication Date 5/30/2017 
Target
Name:
5'-AMP-activated protein kinase catalytic subunit alpha-2
Synonyms:
AAPK2_HUMAN AMP-activated protein kinase, alpha-2 subunit AMPK subunit alpha-2 AMPK2 Hydroxymethylglutaryl-CoA reductase kinase | PRKAA2
Type:
Enzyme
Mol. Mass.:
62331.02
Organism:
Homo sapiens (Human)
Description:
P54646
Residue:
552
  
Inhibitor
Name:
BDBM327871
Synonyms:
N-(4-benzylphenyl)-5- (4-(4- fluorobenzyl)piperazine- 1-carbonyl)picolinamide US9663496, Compound 10
Type:
Small organic molecule
Emp. Form.:
C31H29FN4O2
Mol. Mass.:
508.586
SMILES:
Fc1ccc(CN2CCN(CC2)C(=O)c2ccc(nc2)C(=O)Nc2ccc(Cc3ccccc3)cc2)cc1
: