Target
5-hydroxytryptamine receptor 6
Ligand
BDBM328395
Substrate
Meas. Tech.
Biological Assay
IC50
0.130±n/a nM
Citation
 Zhang, YJin, CZhong, WZhang, JGao, LChen, K Aromatic heterocyclic compounds and their application in pharmaceuticals US Patent  US9663498 Publication Date 5/30/2017 
Target
Name:
5-hydroxytryptamine receptor 6
Synonyms:
5-HT-6 5-hydroxytryptamine receptor 6 (5-HT-6) 5-hydroxytryptamine receptor 6 (5HT6) HTR6 Serotonin 6 (5-HT6) receptor | Serotonin Receptor 6
Type:
G Protein-Coupled Receptor (GPCR)
Mol. Mass.:
46968.43
Organism:
Homo sapiens (Human)
Description:
P50406
Residue:
440
  
Inhibitor
Name:
BDBM328395
Synonyms:
6-chloro-3-(difluoromethyl)-1-((3-(4-ethylpiperazin-1-yl)-4-methoxyphenyl)sulfonyl)-1H-indole | US9663498, Example 37
Type:
Small organic molecule
Emp. Form.:
C22H24ClF2N3O3S
Mol. Mass.:
483.959
SMILES:
CCN1CCN(CC1)c1cc(ccc1OC)S(=O)(=O)n1cc(C(F)F)c2ccc(Cl)cc12
: