Target
5-hydroxytryptamine receptor 6
Ligand
BDBM328398
Substrate
Meas. Tech.
Biological Assay
IC50
0.500±n/a nM
Citation
 Zhang, YJin, CZhong, WZhang, JGao, LChen, K Aromatic heterocyclic compounds and their application in pharmaceuticals US Patent  US9663498 Publication Date 5/30/2017 
Target
Name:
5-hydroxytryptamine receptor 6
Synonyms:
5-HT-6 5-hydroxytryptamine receptor 6 (5-HT-6) 5-hydroxytryptamine receptor 6 (5HT6) HTR6 Serotonin 6 (5-HT6) receptor | Serotonin Receptor 6
Type:
G Protein-Coupled Receptor (GPCR)
Mol. Mass.:
46968.43
Organism:
Homo sapiens (Human)
Description:
P50406
Residue:
440
  
Inhibitor
Name:
BDBM328398
Synonyms:
6-chloro-1-((3-(4-cyclobutylpiperazin-1-yl)-4-methoxyphenyl) sulfonyl)-3-(difluoromethyl)-1H-indole | US9663498, Example 41
Type:
Small organic molecule
Emp. Form.:
C24H26ClF2N3O3S
Mol. Mass.:
509.996
SMILES:
COc1ccc(cc1N1CCN(CC1)C1CCC1)S(=O)(=O)n1cc(C(F)F)c2ccc(Cl)cc12
: