Target
Genome polyprotein
Ligand
BDBM12274
Substrate
NS3-NS4A Chromogenic Peptide Substrate
Meas. Tech.
Continuous Spectrophotometric Assay
pH
6.5±n/a
Temperature
303.15±n/a K
Ki
50±n/a nM
Citation
 Venkatraman, SBogen, SLArasappan, ABennett, FChen, KJao, ELiu, YTLovey, RHendrata, SHuang, YPan, WParekh, TPinto, PPopov, VPike, RRuan, SSanthanam, BVibulbhan, BWu, WYang, WKong, JLiang, XWong, JLiu, RButkiewicz, NChase, RHart, AAgrawal, SIngravallo, PPichardo, JKong, RBaroudy, BMalcolm, BGuo, ZProngay, AMadison, VBroske, LCui, XCheng, KCHsieh, YBrisson, JMPrelusky, DKorfmacher, WWhite, RBogdanowich-Knipp, SPavlovsky, ABradley, PSaksena, AKGanguly, APiwinski, JGirijavallabhan, VNjoroge, FG Discovery of (1R,5S)-N-[3-amino-1-(cyclobutylmethyl)-2,3-dioxopropyl]-3-[2(S)-[[[(1,1-dimethylethyl)amino]carbonyl]amino]-3,3-dimethyl-1-oxobutyl]-6,6-dimethyl-3-azabicyclo[3.1.0]hexan-2(S)-carboxamide (SCH 503034), a selective, potent, orally bioavailable hepatitis C virus NS3 protease inhibitor J Med Chem 49:6074-86 (2006)  
Target
Name:
Genome polyprotein
Synonyms:
Dipeptidyl peptidase 4 (DPP4) NS3 NS5B NS3-4A Protease NS3/4A protease POLG_HCV77 | RNA polymerase (NS5B)
Type:
Protease Domain
Mol. Mass.:
327221.49
Organism:
Hepatitis C virus (HCV genotype 1a, isolate H)
Description:
P27958
Residue:
3011
  
Inhibitor
Name:
BDBM12274
Synonyms:
1-Methyl-1-Phenylethyl-[[3-[[[(1R,5S)-3-[(S)-cyclohexyl[[(1,1-dimethylethoxy)carbonyl]amino]acetyl]-6,6-dimethyl-3-azabicyclo[3.1.0]hexan-2(S)-yl]carbonyl]amino]-1,2-dioxoheptyl]amino]acetate SCH 503034 Analogue 33
Type:
Small organic molecule
Emp. Form.:
C38H56N4O8
Mol. Mass.:
696.8732
SMILES:
CCCC(NC(=O)[C@@H]1[C@@H]2[C@H](CN1C(=O)[C@@H](NC(=O)OC(C)(C)C)C1CCCCC1)C2(C)C)C(=O)C(=O)NCC(=O)OC(C)(C)c1ccccc1
:
Substrate
Name:
NS3-NS4A Chromogenic Peptide Substrate
Synonyms:
Type:
Peptide
Mol. Mass.:
1366.94
Organism:
Description:
The 4-phenylazophenol (PAP) chromophore was incorporated to improve assay sensitivity.
Residue:
13
ACDTEDVVPNVAH