Target
Genome polyprotein
Ligand
BDBM12305
Substrate
NS3-NS4A Chromogenic Peptide Substrate
Meas. Tech.
Continuous Spectrophotometric Assay
Ki
36±n/a nM
Citation
 Venkatraman, SBogen, SLArasappan, ABennett, FChen, KJao, ELiu, YTLovey, RHendrata, SHuang, YPan, WParekh, TPinto, PPopov, VPike, RRuan, SSanthanam, BVibulbhan, BWu, WYang, WKong, JLiang, XWong, JLiu, RButkiewicz, NChase, RHart, AAgrawal, SIngravallo, PPichardo, JKong, RBaroudy, BMalcolm, BGuo, ZProngay, AMadison, VBroske, LCui, XCheng, KCHsieh, YBrisson, JMPrelusky, DKorfmacher, WWhite, RBogdanowich-Knipp, SPavlovsky, ABradley, PSaksena, AKGanguly, APiwinski, JGirijavallabhan, VNjoroge, FG Discovery of (1R,5S)-N-[3-amino-1-(cyclobutylmethyl)-2,3-dioxopropyl]-3-[2(S)-[[[(1,1-dimethylethyl)amino]carbonyl]amino]-3,3-dimethyl-1-oxobutyl]-6,6-dimethyl-3-azabicyclo[3.1.0]hexan-2(S)-carboxamide (SCH 503034), a selective, potent, orally bioavailable hepatitis C virus NS3 protease inhibitor J Med Chem 49:6074-86 (2006)  
Target
Name:
Genome polyprotein
Synonyms:
Dipeptidyl peptidase 4 (DPP4) NS3 NS5B NS3-4A Protease NS3/4A protease POLG_HCV77 | RNA polymerase (NS5B)
Type:
Protease Domain
Mol. Mass.:
327221.49
Organism:
Hepatitis C virus (HCV genotype 1a, isolate H)
Description:
P27958
Residue:
3011
  
Inhibitor
Name:
BDBM12305
Synonyms:
(2R)-3-methylbutan-2-yl N-[(2S)-1-[(1R,2S,5S)-2-[(1-carbamoyl-3-cyclobutyl-1-oxopropan-2-yl)carbamoyl]-6,6-dimethyl-3-azabicyclo[3.1.0]hexan-3-yl]-3,3-dimethyl-1-oxobutan-2-yl]carbamate SCH 503034 Analogue 64
Type:
Small organic molecule
Emp. Form.:
C28H46N4O6
Mol. Mass.:
534.688
SMILES:
CC(C)[C@@H](C)OC(=O)N[C@H](C(=O)N1C[C@H]2[C@@H]([C@H]1C(=O)NC(CC1CCC1)C(=O)C(N)=O)C2(C)C)C(C)(C)C
:
Substrate
Name:
NS3-NS4A Chromogenic Peptide Substrate
Synonyms:
Type:
Peptide
Mol. Mass.:
1366.94
Organism:
Description:
The 4-phenylazophenol (PAP) chromophore was incorporated to improve assay sensitivity.
Residue:
13
ACDTEDVVPNVAH