Target
E3 ubiquitin-protein ligase SMURF1
Ligand
BDBM239094
Substrate
Meas. Tech.
Pharmaceutical Assay
IC50
1.80±n/a nM
Citation
 Bala, KJBrearley, ADale, JEdwards, AAhmed, MPorter, DPulz, RARooney, LASandham, DAShaw, DSmith, NTaylor, JLTaylor, RJTroxler, TJWrigglesworth, J Carboxamide derivatives US Patent  US10195181 Publication Date 2/5/2019 
Target
Name:
E3 ubiquitin-protein ligase SMURF1
Synonyms:
E3 ubiquitin-protein ligase SMURF1 KIAA1625 SMAD-specific E3 ubiquitin-protein ligase 1 SMURF1 | hSMURF1
Type:
PROTEIN
Mol. Mass.:
86120.64
Organism:
Homo sapiens (Human)
Description:
ChEMBL_116984
Residue:
757
  
Inhibitor
Name:
BDBM239094
Synonyms:
US10195181, Example 1.3 | US9403810, 1.3
Type:
Small organic molecule
Emp. Form.:
C24H34N4O3
Mol. Mass.:
426.5518
SMILES:
CCC1CCC(=CC1)c1onc(C(=O)Nc2c(C)n(C)n(C3CCCCC3)c2=O)c1C
: