Target
E3 ubiquitin-protein ligase SMURF1
Ligand
BDBM239117
Substrate
Meas. Tech.
Pharmaceutical Assay
IC50
1.40±n/a nM
Citation
 Bala, KJBrearley, ADale, JEdwards, AAhmed, MPorter, DPulz, RARooney, LASandham, DAShaw, DSmith, NTaylor, JLTaylor, RJTroxler, TJWrigglesworth, J Carboxamide derivatives US Patent  US10195181 Publication Date 2/5/2019 
Target
Name:
E3 ubiquitin-protein ligase SMURF1
Synonyms:
E3 ubiquitin-protein ligase SMURF1 KIAA1625 SMAD-specific E3 ubiquitin-protein ligase 1 SMURF1 | hSMURF1
Type:
PROTEIN
Mol. Mass.:
86120.64
Organism:
Homo sapiens (Human)
Description:
ChEMBL_116984
Residue:
757
  
Inhibitor
Name:
BDBM239117
Synonyms:
US10195181, Example 22c | US9403810, 22
Type:
Small organic molecule
Emp. Form.:
C22H32N4O4
Mol. Mass.:
416.5139
SMILES:
CC1CCC(OC1)c1onc(C(=O)Nc2c(C)n(C)n(C3CCCCC3)c2=O)c1C
: