Target
Prostaglandin E2 receptor EP3 subtype
Ligand
BDBM335701
Substrate
Meas. Tech.
Radioligand SPA Binding Assay
Ki
8.90±n/a nM
Citation
 Bahnck, KCanterbury, DEdmonds, DJFutatsugi, KLee, ECMenhaji-Klotz, EPolivkova, JStanton, RV Antagonists of prostaglandin EP3 receptor US Patent  US9738626 Publication Date 8/22/2017 
Target
Name:
Prostaglandin E2 receptor EP3 subtype
Synonyms:
PE2R3_HUMAN PGE2-R Prostaglandin E2 receptor Prostaglandin E2 receptor EP3 subtype (EP3) Prostaglandin E2 receptor EP3D subtype (EP3D) | Prostanoid EP3 receptor
Type:
Enzyme
Mol. Mass.:
43335.03
Organism:
Homo sapiens (Human)
Description:
P43115
Residue:
390
  
Inhibitor
Name:
BDBM335701
Synonyms:
(R)-6-(5-Chloroquinolin-7-yl)-3-(3-methyl-2-oxopiperidin-3-yl)pyridin-2(1H)-one | US9738626, 4 (free base and TFA salt)
Type:
Small organic molecule
Emp. Form.:
C20H18ClN3O2
Mol. Mass.:
367.829
SMILES:
C[C@@]1(CCCNC1=O)c1ccc([nH]c1=O)-c1cc(Cl)c2cccnc2c1
: