Target
cAMP-specific 3',5'-cyclic phosphodiesterase 4A
Ligand
BDBM336125
Substrate
Meas. Tech.
Enzyme Assay
IC50
0.100±n/a nM
Citation
 Kellenberger, JLDreier, J Selected macrolides with PDE4-inhibiting activity US Patent  US9738676 Publication Date 8/22/2017 
Target
Name:
cAMP-specific 3',5'-cyclic phosphodiesterase 4A
Synonyms:
3',5'-cyclic phosphodiesterase PDE46 PDE4A_HUMAN Phosphodiesterase 4A | Phosphodiesterase 4A (PDE4)
Type:
Enzyme
Mol. Mass.:
98113.27
Organism:
Homo sapiens (Human)
Description:
P27815
Residue:
886
  
Inhibitor
Name:
BDBM336125
Synonyms:
US9738676, Comparative Compound A
Type:
Small organic molecule
Emp. Form.:
C51H72Cl2N4O15S
Mol. Mass.:
1084.106
SMILES:
CC[C@H]1OC(=O)[C@H](C)[C@@H](O)[C@H](C)[C@@H](O[C@@H]2O[C@H](C)C[C@@H]([C@H]2O)N(C)C(=O)N2CCOCC2)[C@@](C)(C[C@@H](C)C(=O)[C@H](C)[C@H]2[C@H](SCCOc3cc(ccc3CO)C(=O)Nc3c(Cl)cncc3Cl)C(=O)O[C@]12C)OC
: