Target
Tyrosine-protein kinase Mer
Ligand
BDBM336260
Substrate
Meas. Tech.
Inhibition Assay
IC50
<10±n/a nM
Citation
 Wang, XLiu, JYang, CZhang, WFrye, SKireev, D Pyrazolopyrimidine compounds for the treatment of cancer US Patent  US9744172 Publication Date 8/29/2017 
Target
Name:
Tyrosine-protein kinase Mer
Synonyms:
MER MERTK Proto-oncogene c-Mer Receptor tyrosine kinase MerTK | Tyrosine-protein kinase Mer
Type:
PROTEIN
Mol. Mass.:
110234.77
Organism:
Homo sapiens (Human)
Description:
ChEMBL_1498723
Residue:
999
  
Inhibitor
Name:
BDBM336260
Synonyms:
US9744172, Compound UNC00000569A
Type:
Small organic molecule
Emp. Form.:
C22H29FN6
Mol. Mass.:
396.5043
SMILES:
CCCCNc1ncc2c(nn(CC3CC[C@H](N)CC3)c2n1)-c1ccc(F)cc1
: