Target
Rho-associated protein kinase 2
Ligand
BDBM14029
Substrate
Kemptide
Meas. Tech.
Kinase Activity Assay
IC50
500±n/a nM
Citation
 Bonn, SHerrero, SBreitenlechner, CBErlbruch, ALehmann, WEngh, RAGassel, MBossemeyer, D Structural analysis of protein kinase A mutants with Rho-kinase inhibitor specificity. J Biol Chem 281:24818-30 (2006)  
Target
Name:
Rho-associated protein kinase 2
Synonyms:
ROCK2 Rho-associated, coiled-coil-containing protein kinase 2 p164 ROCK-2
Type:
Kinase Domain
Mol. Mass.:
160784.81
Organism:
Bos taurus (bovine)
Description:
Q28021
Residue:
1388
  
Inhibitor
Name:
BDBM14029
Synonyms:
(R)-TRANS-4-(1-AMINOETHYL)-N-(4-PYRIDYL) CYCLOHEXANECARBOXAMIDE US10183931, Y-27632 | Y-27632
Type:
Small organic molecule
Emp. Form.:
C14H21N3O
Mol. Mass.:
247.336
SMILES:
[H][C@@]1(CC[C@@]([H])(CC1)C(=O)Nc1ccncc1)[C@@H](C)N
:
Substrate
Name:
Kemptide
Synonyms:
Aurora Peptide Substrate
Type:
Peptide
Mol. Mass.:
773.92
Organism:
Description:
50 uM ATP as co-substrate.
Residue:
7
LRRASLG