Target
cAMP-dependent protein kinase catalytic subunit alpha
Ligand
BDBM14028
Substrate
Kemptide
Meas. Tech.
Kinase Activity Assay
pH
7.6±n/a
Temperature
303.15±n/a K
Ki
340±n/a nM
Citation
 Jacobs, MHayakawa, KSwenson, LBellon, SFleming, MTaslimi, PDoran, J The structure of dimeric ROCK I reveals the mechanism for ligand selectivity. J Biol Chem 281:260-8 (2006)  
Target
Name:
cAMP-dependent protein kinase catalytic subunit alpha
Synonyms:
KAPCA_MOUSE Pkaca cAMP-Dependent Protein Kinase (PKA) cAMP-dependent protein kinase, alpha-catalytic subunit
Type:
Enzyme Catalytic Unit
Mol. Mass.:
40579.18
Organism:
Mus musculus (mouse)
Description:
Residue:
351
  
Inhibitor
Name:
BDBM14028
Synonyms:
(S)-2-METHYL-1-[(4-METHYL-5-ISOQUINOLINE)SULFONYL]-HOMOPIPERAZINE H-1152 | H-1152P
Type:
Small organic molecule
Emp. Form.:
C16H21N3O2S
Mol. Mass.:
319.422
SMILES:
C[C@H]1CNCCCN1S(=O)(=O)c1cccc2cncc(C)c12
:
Substrate
Name:
Kemptide
Synonyms:
Aurora Peptide Substrate
Type:
Peptide
Mol. Mass.:
773.92
Organism:
Description:
50 uM ATP as co-substrate.
Residue:
7
LRRASLG