Target
Actin
Ligand
BDBM65506
Substrate
Meas. Tech.
Liquid growth assay
Temperature
303.15±0 K
IC50
140±0.0 nM
Citation
 Filipuzzi, IThomas, JRPries, VEstoppey, DSalcius, MStuder, CSchirle, MHoepfner, D Direct Interaction of Chivosazole F with Actin Elicits Cell Responses Similar to Latrunculin A but Distinct from Chondramide. ACS Chem Biol 12:2264-2269 (2017)  
Target
Name:
Actin
Synonyms:
ABY1 ACT_YEAST END7
Type:
Protein
Mol. Mass.:
41683.13
Organism:
Baker's yeast
Description:
P60010
Residue:
375
  
Inhibitor
Name:
BDBM65506
Synonyms:
CHEBI:80062 SCHEMBL1889389
Type:
Small organic molecule
Emp. Form.:
C41H57NO8
Mol. Mass.:
691.8932
SMILES:
COC1CC(O)\C=C\C=C\C=C/C(C)C(OC(=O)\C=C/C=C/C=C\C(\C)=C\C(C)C(O)\C=C/C=C/c2coc(n2)C1C)C(C)C(O)CC(C)O
: