Target
Large neutral amino acids transporter small subunit 1
Ligand
BDBM340533
Substrate
Meas. Tech.
Inhibitory Activity Assay
IC50
89100±n/a nM
Citation
 Kanai, YNagamori, SKitaura, YNeya, MMatsushita, N Phenoxyalkylamine compound US Patent  US9771316 Publication Date 9/26/2017 
Target
Name:
Large neutral amino acids transporter small subunit 1
Synonyms:
4F2 LC 4F2LC CD98LC Integral membrane protein E16 LAT1 Large neutral amino acids transporter small subunit 1 SLC7A5 hLAT1 | y+ system cationic amino acid transporter
Type:
PROTEIN
Mol. Mass.:
55013.61
Organism:
Homo sapiens (Human)
Description:
ChEMBL_100160
Residue:
507
  
Inhibitor
Name:
BDBM340533
Synonyms:
US9771316, Example 6
Type:
Small organic molecule
Emp. Form.:
C19H22F3NO
Mol. Mass.:
337.3793
SMILES:
NCCCCCC(Oc1ccc(cc1)C(F)(F)F)c1ccccc1
: