Target
Urokinase-type plasminogen activator [179-431,I214M,N322A,S371A]
Ligand
BDBM14142
Substrate
BDBM14484
Meas. Tech.
Enzyme Assay and Determination of the Inhibition Constants
Ki
380±n/a nM
Citation
 Katz, BALuong, CHo, JDSomoza, JRGjerstad, ETang, JWilliams, SRVerner, EMackman, RLYoung, WBSprengeler, PAChan, HMortara, KJanc, JWMcGrath, ME Dissecting and designing inhibitor selectivity determinants at the S1 site using an artificial Ala190 protease (Ala190 uPA). J Mol Biol 344:527-47 (2004)  
Target
Name:
Urokinase-type plasminogen activator [179-431,I214M,N322A,S371A]
Synonyms:
LMW uPA U-plasminogen activator Urokinase (uPA) Mutant (S190A) | deglycosylated (N145A) LMW uPA Mutant S190A
Type:
Enzyme
Mol. Mass.:
28389.65
Organism:
Homo sapiens (Human)
Description:
Mutagenically deglycosylated (N145A) low molecular mass urokinase (S190A), referred to as Ala190 uPA.
Residue:
253
  
Inhibitor
Name:
BDBM14142
Synonyms:
2-{5-[amino(iminiumyl)methyl]-1H-indol-2-yl}-6-phenylbenzen-1-olate APC-8696 CRA-8696
Type:
Small organic molecule
Emp. Form.:
C21H17N3O
Mol. Mass.:
327.3792
SMILES:
NC(=[NH2+])c1ccc2[nH]c(cc2c1)-c1cccc(-c2ccccc2)c1[O-]
:
Substrate
Name:
BDBM14484
Synonyms:
4-{[({4-carbamimidamido-1-[(4-methyl-2-oxo-2H-chromen-7-yl)carbamoyl]butyl}carbamoyl)methyl]carbamoyl}butanoic acid hydrochloride uPA Substrate
Type:
Emp. Form.:
Mol. Mass.:
SMILES:
: