Target
Serine/threonine-protein kinase Chk1
Ligand
BDBM14828
Substrate
Cdc25C peptide substrate
Meas. Tech.
Chk1 Enzymatic Assay
pH
7.4±n/a
Temperature
295.15±n/a K
IC50
10±n/a nM
Citation
 Wang, GTLi, GMantei, RAChen, ZKovar, PGu, WXiao, ZZhang, HSham, HLSowin, TRosenberg, SHLin, NH 1-(5-Chloro-2-alkoxyphenyl)-3-(5-cyanopyrazin-2-yl)ureas [correction of cyanopyrazi] as potent and selective inhibitors of Chk1 kinase: synthesis, preliminary SAR, and biological activities. J Med Chem 48:3118-21 (2005)  
Target
Name:
Serine/threonine-protein kinase Chk1
Synonyms:
CHEK1 CHK1 checkpoint homolog Checkpoint kinase-1 (CHK1)
Type:
Enzyme Catalytic Domain
Mol. Mass.:
54443.02
Organism:
Homo sapiens (Human)
Description:
gi_166295192
Residue:
476
  
Inhibitor
Name:
BDBM14828
Synonyms:
(+/-)1-[5-Chloro-2-(1-methyl-piperidin-4-yloxy)-phenyl]-3-(5-cyano-pyrazin-2-yl)-urea urea-based inhibitor 2c
Type:
Small organic molecule
Emp. Form.:
C18H19ClN6O2
Mol. Mass.:
386.835
SMILES:
CN1CCC(CC1)Oc1ccc(Cl)cc1NC(=O)Nc1cnc(cn1)C#N
:
Substrate
Name:
Cdc25C peptide substrate
Synonyms:
Type:
Peptide
Mol. Mass.:
2519.88
Organism:
Description:
Cdc25c peptide substrate contained a sequence of amino acid residues 204-225 of human phosphatase Cdc25C.
Residue:
22