Target
RAC-beta serine/threonine-protein kinase
Ligand
BDBM15131
Substrate
AKTide-2T
Meas. Tech.
PKB In Vitro Enzyme Assay
pH
7.2±n/a
Temperature
295.15±n/a K
IC50
0.5±n/a nM
Citation
 Davies, TGVerdonk, MLGraham, BSaalau-Bethell, SHamlett, CCMcHardy, TCollins, IGarrett, MDWorkman, PWoodhead, SJJhoti, HBarford, D A structural comparison of inhibitor binding to PKB, PKA and PKA-PKB chimera. J Mol Biol 367:882-94 (2007)  
Target
Name:
RAC-beta serine/threonine-protein kinase
Synonyms:
AKT2 PKB beta Protein kinase B (Akt 2) Protein kinase B, beta RAC-alpha serine/threonine-protein kinase (AKT2) RAC-beta serine/threonine-protein kinase (AKT2) Serine/threonine-protein kinase AKT2 | Serine/threonine-protein kinase Rac alpha/beta
Type:
Enzyme
Mol. Mass.:
55766.64
Organism:
Homo sapiens (Human)
Description:
Residue:
481
  
Inhibitor
Name:
BDBM15131
Synonyms:
5-indazolyl pyridine 3 A-443654 | indazole-pyridine, 4
Type:
Small organic molecule
Emp. Form.:
C24H23N5O
Mol. Mass.:
397.4723
SMILES:
Cc1n[nH]c2ccc(cc12)-c1cncc(OC[C@@H](N)Cc2c[nH]c3ccccc23)c1
:
Substrate
Name:
AKTide-2T
Synonyms:
AKT/PKB/Rac Protein Kinase Substrate
Type:
Peptide
Mol. Mass.:
1719.90
Organism:
Description:
Residue:
14
ARKRERTYSFGHHA