Target
15-hydroxyprostaglandin dehydrogenase [NAD(+)]
Ligand
BDBM347379
Substrate
Meas. Tech.
In Vitro Assay
IC50
1.34±n/a nM
Citation
 Markowitz, SWillson, JKPosner, BReady, JAntczak, MZhang, YDesai, AGerson, SGreenlee, W Compositions and methods of modulating short-chain dehydrogenase activity US Patent  US9789116 Publication Date 10/17/2017 
Target
Name:
15-hydroxyprostaglandin dehydrogenase [NAD(+)]
Synonyms:
15-PGDH HPGD PGDH_HUMAN SDR36C1
Type:
Enzyme
Mol. Mass.:
28974.46
Organism:
Homo sapiens (Human)
Description:
P15428
Residue:
266
  
Inhibitor
Name:
BDBM347379
Synonyms:
US10869871, ID # SW211668-(33291-R US9789116, SW211668
Type:
Small organic molecule
Emp. Form.:
C21H20N2OS3
Mol. Mass.:
412.591
SMILES:
CCCC[S@@+]([O-])c1sc2nc(cc(-c3ccccc3)c2c1N)-c1cccs1
: