Target
Fibroblast growth factor receptor 2
Ligand
BDBM350045
Substrate
Meas. Tech.
Enzyme Assay
IC50
1.40±n/a nM
Citation
 Andrews, SWBlake, JFCook, AGunawardana, IWHunt, KWMetcalf, ATMoreno, DRen, LTang, TP 2-aryl- and 2-heteroaryl-substituted 2-pyridazin-3(2H)-one compounds as inhibitors of FGFR tyrosine kinases US Patent  US10208024 Publication Date 2/19/2019 
Target
Name:
Fibroblast growth factor receptor 2
Synonyms:
BEK FGFR-2 FGFR2 Fibroblast growth factor receptor 2 (FGFR2) KGFR Keratinocyte growth factor receptor VEGF-receptor 2 and Fibroblast growth factor receptor 2
Type:
Enzyme
Mol. Mass.:
92015.45
Organism:
Homo sapiens (Human)
Description:
P21802
Residue:
821
  
Inhibitor
Name:
BDBM350045
Synonyms:
US10208024, Example 44 | US10766881, Example 44
Type:
Small organic molecule
Emp. Form.:
C22H23N7O3
Mol. Mass.:
433.4631
SMILES:
CCc1cc(nn(-c2cc(OC)cc(OC)c2)c1=O)-c1nc(cnc1N)-c1cnn(C)c1
: