Target
Beta-secretase 1 [1-453]
Ligand
BDBM16072
Substrate
BACE Peptide Substrate
Meas. Tech.
Enzyme Inhibition Measurements
pH
4.5±n/a
Temperature
295.15±n/a K
IC50
>10000±n/a nM
Citation
 Hanessian, SYang, GRondeau, JMNeumann, UBetschart, CTintelnot-Blomley, M Structure-based design and synthesis of macroheterocyclic peptidomimetic inhibitors of the aspartic protease beta-site amyloid precursor protein cleaving enzyme (BACE). J Med Chem 49:4544-67 (2006)  
Target
Name:
Beta-secretase 1 [1-453]
Synonyms:
ASP2 Aspartyl protease 2 BACE1 Beta-site APP cleaving enzyme 1 KIAA1149 Membrane-associated aspartic protease 2 | beta-Secretase (BACE-1)
Type:
Enzyme
Mol. Mass.:
50193.81
Organism:
Homo sapiens (Human)
Description:
Recombinant human BACE (SwissProt accession number P56817, amino acids 1-453 + a thrombin-cleavable C-kappa tag) was produced in-house using Sf9 insect cells.
Residue:
453
  
Inhibitor
Name:
BDBM16072
Synonyms:
(2R,4S)-4-[(3R,6S,9R)-9-(acetylamino)-6-methyl-5,8-dioxo-1,11-dithia-4,7-diazacycloheptadecan-3-yl]-N-butyl-4-hydroxy-2-methylbutanamide dithia macrocycle compound 31
Type:
Small organic molecule
Emp. Form.:
C25H46N4O5S2
Mol. Mass.:
546.787
SMILES:
CCCCNC(=O)[C@H](C)C[C@H](O)[C@@H]1CSCCCCCCSC[C@H](NC(C)=O)C(=O)N[C@@H](C)C(=O)N1
:
Substrate
Name:
BACE Peptide Substrate
Synonyms:
Type:
Peptide
Mol. Mass.:
1917.56
Organism:
Description:
Peptide substrates were obtained from Bachem (Bubendorf, Switzerland).
Residue:
17
MCASEVNLDAEFKDNPH