Target
Cathepsin D
Ligand
BDBM16076
Substrate
Cathepsin D Peptide Substrate
Meas. Tech.
Enzyme Inhibition Measurements
Temperature
298.15±n/a K
IC50
150±n/a nM
Comments
extracted
Citation
 Hanessian, SYang, GRondeau, JMNeumann, UBetschart, CTintelnot-Blomley, M Structure-based design and synthesis of macroheterocyclic peptidomimetic inhibitors of the aspartic protease beta-site amyloid precursor protein cleaving enzyme (BACE). J Med Chem 49:4544-67 (2006)  
Target
Name:
Cathepsin D
Synonyms:
CATD_HUMAN CTSD Cathepsin D heavy chain Cathepsin D precursor
Type:
Enzyme
Mol. Mass.:
44551.72
Organism:
Homo sapiens (Human)
Description:
Human proCathepsin D (SwissProt accession number P07339) was expressed in Sf9 cells, purified, and autoactivated.
Residue:
412
  
Inhibitor
Name:
BDBM16076
Synonyms:
(2R,4S)-4-[(3R,6S,9R,13E)-9-amino-6-methyl-5,8-dioxo-1,11-dithia-4,7-diazacyclopentadec-13-en-3-yl]-N-butyl-4-hydroxy-2-methylbutanamide | dithia macrocycle compound 102
Type:
Small organic molecule
Emp. Form.:
C21H38N4O4S2
Mol. Mass.:
474.681
SMILES:
CCCCNC(=O)[C@H](C)C[C@H](O)[C@@H]1CSC\C=C\CSC[C@H](N)C(=O)N[C@@H](C)C(=O)N1
:
Substrate
Name:
Cathepsin D Peptide Substrate
Synonyms:
Type:
Peptide
Mol. Mass.:
2375.29
Organism:
Description:
Peptide substrates were obtained from Bachem (Bubendorf, Switzerland).
Residue:
20