Target
Renin
Ligand
BDBM17974
Substrate
Green Flourescent Protein (tGFP)
Meas. Tech.
In Vitro Renin IC50 Determinations (Tandem GFP FRET Assay)
pH
7.4±n/a
Temperature
295.15±n/a K
IC50
132±n/a nM
Citation
 Sarver, RWPeevers, JCody, WLCiske, FLDyer, JEmerson, SDHagadorn, JCHolsworth, DDJalaie, MKaufman, MMastronardi, MMcConnell, PPowell, NAQuin, JVan Huis, CAZhang, EMochalkin, I Binding thermodynamics of substituted diaminopyrimidine renin inhibitors. Anal Biochem 360:30-40 (2007)  
Target
Name:
Renin
Synonyms:
Angiotensinogenase RENI_HUMAN
Type:
Enzyme
Mol. Mass.:
45058.99
Organism:
Homo sapiens (Human)
Description:
Residue:
406
  
Inhibitor
Name:
BDBM17974
Synonyms:
(2R)-6-(2,4-diamino-6-ethylpyrimidin-5-yl)-4-(3-methoxypropyl)-2-methyl-3,4-dihydro-2H-1,4-benzoxazin-3-one diaminopyrimidine renin inhibitor compound, 5
Type:
Small organic molecule
Emp. Form.:
C19H25N5O3
Mol. Mass.:
371.4335
SMILES:
CCc1nc(N)nc(N)c1-c1ccc2O[C@H](C)C(=O)N(CCCOC)c2c1
:
Substrate
Name:
Green Flourescent Protein (tGFP)
Synonyms:
Type:
Other Protein Type
Mol. Mass.:
358.43
Organism:
Description:
The tGFP substrate contained a nine amino acid (Ile-His-Pro-Phe-His-Leu-Val-Ile-His) recognition sequence for human renin flanked by two GPF proteins (W1B and Topaz).
Residue:
3
NA