Target
Glycine--tRNA ligase
Ligand
BDBM18137
Substrate
BDBM18133
Meas. Tech.
In Vitro Enzyme Activity Assay
pH
7.5±n/a
Temperature
298.15±n/a K
Ki
80000±n/a nM
IC50
800000±n/a nM
Citation
 Dignam, JDNada, SChaires, JB Thermodynamic characterization of the binding of nucleotides to glycyl-tRNA synthetase. Biochemistry 42:5333-40 (2003)  
Target
Name:
Glycine--tRNA ligase
Synonyms:
GARS_BOMMO Glycine--tRNA ligase tRNA synthetase (GlyRS)
Type:
Enzyme
Mol. Mass.:
76917.70
Organism:
Bombyx mori
Description:
B. mori glycyltRNA synthetase was expressed in E. coli.
Residue:
680
  
Inhibitor
Name:
BDBM18137
Synonyms:
AMP US11185100, TABLE 7.3 adenosine 5 -monophosphate | {[(2R,3S,4R,5R)-5-(6-amino-9H-purin-9-yl)-3,4-dihydroxyoxolan-2-yl]methoxy}phosphonic acid
Type:
Nucleoside or nucleotide
Emp. Form.:
C10H14N5O7P
Mol. Mass.:
347.2212
SMILES:
Nc1ncnc2n(cnc12)[C@@H]1O[C@H](COP(O)(O)=O)[C@@H](O)[C@H]1O
:
Substrate
Name:
BDBM18133
Synonyms:
2-aminoacetic acid Glycine | [14C]Glycine
Type:
Amino Acid
Emp. Form.:
C2H5NO2
Mol. Mass.:
75.0666
SMILES:
NCC(O)=O
: