Target
Dihydrofolate reductase
Ligand
BDBM18237
Substrate
BDBM18044
Meas. Tech.
Determination of IC50
IC50
0.47±n/a nM
Citation
 Chan, DCFu, HForsch, RAQueener, SFRosowsky, A Design, synthesis, and antifolate activity of new analogues of piritrexim and other diaminopyrimidine dihydrofolate reductase inhibitors with omega-carboxyalkoxy or omega-carboxy-1-alkynyl substitution in the side chain. J Med Chem 48:4420-31 (2005)  
Target
Name:
Dihydrofolate reductase
Synonyms:
Dihydrofolate reductase (DHFR) | Tetrahydrofolate dehydrogenase
Type:
Enzyme
Mol. Mass.:
19884.75
Organism:
Mycobacterium avium
Description:
Recombinant Mycobacterium avium DHFR expressed in E. coli.
Residue:
181
  
Inhibitor
Name:
BDBM18237
Synonyms:
5-{2-bromo-5-[(2,4-diaminopyrimidin-5-yl)methyl]-3-methoxyphenyl}pent-4-ynoic acid | Diaminopyrimidine analogue, 22
Type:
Small organic molecule
Emp. Form.:
C17H17BrN4O3
Mol. Mass.:
405.246
SMILES:
COc1cc(Cc2cnc(N)nc2N)cc(C#CCCC(O)=O)c1Br
:
Substrate
Name:
BDBM18044
Synonyms:
(2S)-2-[(4-{[(2-amino-4-oxo-1,4,7,8-tetrahydropteridin-6-yl)methyl]amino}phenyl)formamido]pentanedioic acid dihydrofolic acid
Type:
Small organic molecule
Emp. Form.:
C19H21N7O6
Mol. Mass.:
443.4133
SMILES:
Nc1nc2NCC(CNc3ccc(cc3)C(=O)N[C@@H](CCC(O)=O)C(O)=O)=Nc2c(=O)[nH]1
: