Target
3-hydroxy-3-methylglutaryl-coenzyme A reductase
Ligand
BDBM18382
Substrate
BDBM18373
Meas. Tech.
HMG-CoA Reductase In Vitro Assay
pH
7.2±n/a
Temperature
310.15±n/a K
IC50
0.85±n/a nM
Citation
 Bratton, LDAuerbach, BChoi, CDillon, LHanselman, JCLarsen, SDLu, GOlsen, KPfefferkorn, JARobertson, ASekerke, CTrivedi, BKUnangst, PC Discovery of pyrrole-based hepatoselective ligands as potent inhibitors of HMG-CoA reductase. Bioorg Med Chem 15:5576-89 (2007)  
Target
Name:
3-hydroxy-3-methylglutaryl-coenzyme A reductase
Synonyms:
HMDH_RAT Hmgcr
Type:
Enzyme
Mol. Mass.:
96689.85
Organism:
Rattus norvegicus (rat)
Description:
Isolated rat liver microsomes were used as enzyme source.
Residue:
887
  
Inhibitor
Name:
BDBM18382
Synonyms:
Alkyl substituted pyrrole compound, 29f | disodium 4-[({5-[(3R,5R)-6-carboxylato-3,5-dihydroxyhexyl]-1-ethyl-4-(4-fluorophenyl)-3-methyl-1H-pyrrol-2-yl}formamido)methyl]benzoate
Type:
Small organic molecule
Emp. Form.:
C29H31FN2O7
Mol. Mass.:
538.5651
SMILES:
CCn1c(CC[C@@H](O)C[C@@H](O)CC([O-])=O)c(c(C)c1C(=O)NCc1ccc(cc1)C([O-])=O)-c1ccc(F)cc1
:
Substrate
Name:
BDBM18373
Synonyms:
3-Hydroxy-3-methylglutaryl-CoA | HMG-CoA
Type:
Emp. Form.:
C27H44N7O20P3S
Mol. Mass.:
911.659
SMILES:
C[C@](O)(CC(O)=O)CC(=O)SCCNC(=O)CCNC(=O)C(O)C(C)(C)COP(O)(=O)OP(O)(=O)OC[C@H]1O[C@H]([C@H](O)[C@@H]1OP(O)(O)=O)n1cnc2c(N)ncnc12
: