Target
Estrogen receptor
Ligand
BDBM19460
Substrate
17beta-estradiol (E2)
Meas. Tech.
Competition-Based Ligand Binding Assay.
pH
7.6±n/a
Temperature
295.15±n/a K
IC50
57±10 nM
Citation
 Roelens, FHeldring, NDhooge, WBengtsson, MComhaire, FGustafsson, JATreuter, EDe Keukeleire, D Subtle side-chain modifications of the hop phytoestrogen 8-prenylnaringenin result in distinct agonist/antagonist activity profiles for estrogen receptors alpha and beta. J Med Chem 49:7357-65 (2006)  
Target
Name:
Estrogen receptor
Synonyms:
ER ESR ESR1_HUMAN Estrogen receptor Estrogen receptor (ER-alpha) Estrogen receptor alpha (ER) Nuclear receptor subfamily 3 group A member 1
Type:
Protein
Mol. Mass.:
66230.44
Organism:
Homo sapiens (Human)
Description:
P03372
Residue:
595
  
Inhibitor
Name:
BDBM19460
Synonyms:
(2S)-5,7-dihydroxy-2-(4-hydroxyphenyl)-8-(3-methylbut-2-en-1-yl)-3,4-dihydro-2H-1-benzopyran-4-one AIDS095901 YS04 | cid_509245
Type:
Phytoestrogen
Emp. Form.:
C20H20O5
Mol. Mass.:
340.3698
SMILES:
[#6]\[#6](-[#6])=[#6]\[#6]-c1c(-[#8])cc(-[#8])c2-[#6](=O)-[#6]-[#6@H](-[#8]-c12)-c1ccc(-[#8])cc1
:
Substrate
Name:
BDBM17292
Synonyms:
(1S,10R,11S,14S,15S)-15-methyltetracyclo[8.7.0.0^{2,7}.0^{11,15}]heptadeca-2,4,6-triene-5,14-diol 17α-ethinylestradiol CHEMBL135 ESTRADIOL Ovocyclin US9040509, E2 US9561238, E2 [2,4,6,7-3H]-E2 [3H]]estradiol
Type:
Steroid
Emp. Form.:
C18H24O2
Mol. Mass.:
272.382
SMILES:
[H][C@@]12CC[C@H](O)[C@@]1(C)CC[C@]1([H])c3ccc(O)cc3CC[C@@]21[H]
: