Target
Alkaline phosphatase, tissue-nonspecific isozyme
Ligand
BDBM275064
Substrate
Meas. Tech.
Inhibitory Test of TNAP Activity
IC50
6.10±n/a nM
Citation
 Miyazaki, SYamamoto, YSuzuki, KInui, MIzumi, MSoma, KPinkerton, AShinozaki, T Pyridine compounds US Patent  US10221195 Publication Date 3/5/2019 
Target
Name:
Alkaline phosphatase, tissue-nonspecific isozyme
Synonyms:
ALPL tissue-nonspecific alkaline phosphatase precursor
Type:
PROTEIN
Mol. Mass.:
57306.17
Organism:
Homo sapiens (Human)
Description:
ChEMBL_1448917
Residue:
524
  
Inhibitor
Name:
BDBM275064
Synonyms:
US10221195, Example 6 | US9879032, Example 6
Type:
Small organic molecule
Emp. Form.:
C17H18ClN3O6S
Mol. Mass.:
427.859
SMILES:
COc1ccc(Cl)cc1S(=O)(=O)Nc1cnc2OCCN(CCO)C(=O)c2c1
: