Target
Phosphatidylinositol 3,4,5-trisphosphate 5-phosphatase 2
Ligand
BDBM50054261
Substrate
Meas. Tech.
PTP Assay
IC50
420±20 nM
Citation
 Zhang, ZKontaridis, MZeng, LWang, J SHP2 inhibitors and methods of treating autoimmune and/or glomerulonephritis-associated diseases using SHP2 inhibitors US Patent  US9844535 Publication Date 12/19/2017 
Target
Name:
Phosphatidylinositol 3,4,5-trisphosphate 5-phosphatase 2
Synonyms:
INPPL-1 Inositol polyphosphate phosphatase-like protein 1 Protein 51C SHIP-2 SHIP2_HUMAN | Src homology-2 domain containing protein tyrosine phosphatase-2 (SHP2)
Type:
Enzyme
Mol. Mass.:
138596.65
Organism:
Homo sapiens (Human)
Description:
O15357
Residue:
1258
  
Inhibitor
Name:
BDBM50054261
Synonyms:
CHEMBL3319380 US9844535, ID 11a-25 L97L06
Type:
Small organic molecule
Emp. Form.:
C31H21IN4O5
Mol. Mass.:
656.4267
SMILES:
Cn1c(c(I)c2cc(C(O)=O)c(O)cc12)-c1cccc(NC(=O)C(=O)Nc2cccc(c2)-c2ccc(cc2)C#N)c1
: