Target
3-phosphoinositide-dependent protein kinase 1 [51-360]
Ligand
BDBM366096
Substrate
Meas. Tech.
Kinase Assay
IC50
<500±n/a nM
Citation
 Lind, KECao, KLin, EYNguyen, TBTangonan, BTErlanson, DAGuckian, KSimmons, RLLee, WSun, LHansen, SPathan, NZhang, L Methods of treatment using pyridinonyl PDK1 inhibitors US Patent  US9873693 Publication Date 1/23/2018 
Target
Name:
3-phosphoinositide-dependent protein kinase 1 [51-360]
Synonyms:
3-phosphoinositide-dependent protein kinase 1 (PDK1) PDPK1 | PDPK1_HUMAN
Type:
Enzyme Catalytic Domain
Mol. Mass.:
35373.34
Organism:
Homo sapiens (Human)
Description:
(aa 51-360)
Residue:
310
  
Inhibitor
Name:
BDBM366096
Synonyms:
US9873693, Compound 19
Type:
Small organic molecule
Emp. Form.:
C27H21F2N5O3S
Mol. Mass.:
533.549
SMILES:
NC(=O)C[C@@H](NC(=O)c1cccn(Cc2ccc(F)c(F)c2)c1=O)c1ccc(s1)-c1c[nH]c2ncccc12
: