Target
3-phosphoinositide-dependent protein kinase 1 [51-360]
Ligand
BDBM366106
Substrate
Meas. Tech.
Kinase Assay
IC50
<500±n/a nM
Citation
 Lind, KECao, KLin, EYNguyen, TBTangonan, BTErlanson, DAGuckian, KSimmons, RLLee, WSun, LHansen, SPathan, NZhang, L Methods of treatment using pyridinonyl PDK1 inhibitors US Patent  US9873693 Publication Date 1/23/2018 
Target
Name:
3-phosphoinositide-dependent protein kinase 1 [51-360]
Synonyms:
3-phosphoinositide-dependent protein kinase 1 (PDK1) PDPK1 | PDPK1_HUMAN
Type:
Enzyme Catalytic Domain
Mol. Mass.:
35373.34
Organism:
Homo sapiens (Human)
Description:
(aa 51-360)
Residue:
310
  
Inhibitor
Name:
BDBM366106
Synonyms:
US9873693, Compound 29
Type:
Small organic molecule
Emp. Form.:
C31H27F2N5O3
Mol. Mass.:
555.5746
SMILES:
CCCNC(=O)c1cnc2[nH]cc(-c3cccc(CNC(=O)c4cccn(Cc5ccc(F)c(F)c5)c4=O)c3)c2c1
: