Target
Mu-type opioid receptor
Ligand
BDBM50276568
Substrate
Meas. Tech.
Opioid Receptor Binding Assay
IC50
130±n/a nM
Citation
 Blumberg, LCDeaver, DREyerman, DJWynn, TA Methods for treating depressive symptoms US Patent  US10231963 Publication Date 3/19/2019 
Target
Name:
Mu-type opioid receptor
Synonyms:
M-OR-1 MOR-1 MUOR1 Mu opiate receptor OPRM1 hMOP | mu-type opioid receptor isoform MOR-1
Type:
G Protein-Coupled Receptor (GPCR)
Mol. Mass.:
44789.51
Organism:
Homo sapiens (Human)
Description:
P35372
Residue:
400
  
Inhibitor
Name:
BDBM50276568
Synonyms:
CHEMBL1685 Dalgan US9656961, Example 00124 | WY-16225
Type:
Small organic molecule
Emp. Form.:
C16H23NO
Mol. Mass.:
245.3599
SMILES:
C[C@@]12CCCCC[C@@H](Cc3ccc(O)cc13)[C@@H]2N
: