Target
Lysine-specific histone demethylase 1A
Ligand
BDBM369484
Substrate
Meas. Tech.
LSD1 enzymatic activity
IC50
3.00±n/a nM
Citation
 Marx, MAVaisburg, AChristensen, JGGalemmo, Jr., RA LSD1 inhibitors US Patent  US10233152 Publication Date 3/19/2019 
Target
Name:
Lysine-specific histone demethylase 1A
Synonyms:
AOF2 Flavin-containing amine oxidase domain-containing protein 2 KDM1A KIAA0601 Lysine-specific demethylase 1 (LSD1) Lysine-specific histone demethylase 1 (LSD1)
Type:
Enzyme
Mol. Mass.:
92901.01
Organism:
Homo sapiens (Human)
Description:
O60341
Residue:
852
  
Inhibitor
Name:
BDBM369484
Synonyms:
US10233152, Example 24
Type:
Small organic molecule
Emp. Form.:
C26H33N3O3
Mol. Mass.:
435.5585
SMILES:
O=C1OCCCN1c1ccc(OCCN2CCC(CC2)N[C@@H]2C[C@H]2c2ccccc2)cc1
: