Target
Lysine-specific histone demethylase 1A
Ligand
BDBM369621
Substrate
Meas. Tech.
LSD1 enzymatic activity
IC50
2.00±n/a nM
Citation
 Marx, MAVaisburg, AChristensen, JGGalemmo, Jr., RA LSD1 inhibitors US Patent  US10233152 Publication Date 3/19/2019 
Target
Name:
Lysine-specific histone demethylase 1A
Synonyms:
AOF2 Flavin-containing amine oxidase domain-containing protein 2 KDM1A KIAA0601 Lysine-specific demethylase 1 (LSD1) Lysine-specific histone demethylase 1 (LSD1)
Type:
Enzyme
Mol. Mass.:
92901.01
Organism:
Homo sapiens (Human)
Description:
O60341
Residue:
852
  
Inhibitor
Name:
BDBM369621
Synonyms:
US10233152, Example 128
Type:
Small organic molecule
Emp. Form.:
C17H27N3O2S
Mol. Mass.:
337.48
SMILES:
CNS(=O)(=O)CCN1CCC(CC1)N[C@@H]1C[C@H]1c1ccccc1
: