Target
Angiotensin-converting enzyme 2
Ligand
BDBM21463
Substrate
BDBM21453
Meas. Tech.
Enzyme Inhibition Assay
pH
6.8±n/a
Temperature
298.15±n/a K
Ki
7.5±n/a nM
Citation
 Mores, AMatziari, MBeau, FCuniasse, PYiotakis, ADive, V Development of Potent and Selective Phosphinic Peptide Inhibitors of Angiotensin-Converting Enzyme 2. J Med Chem 51:2216-2226 (2008)  
Target
Name:
Angiotensin-converting enzyme 2
Synonyms:
ACE-related carboxypeptidase ACE2_HUMAN Angiotensin-converting enzyme homolog Metalloprotease MPROT15
Type:
Enzyme
Mol. Mass.:
92448.86
Organism:
Homo sapiens (Human)
Description:
Residue:
805
  
Inhibitor
Name:
BDBM21463
Synonyms:
2-benzyl-3-{[1-(2-acetamidopropanoyl)pyrrolidin-2-yl](hydroxy)phosphoryl}propanoic acid | Phosphinic Peptide Inhibitor, 27
Type:
Small organic molecule
Emp. Form.:
C19H27N2O6P
Mol. Mass.:
410.4012
SMILES:
CC(NC(C)=O)C(=O)N1CCC=C1P(O)(O)CC(Cc1ccccc1)C(O)=O
:
Substrate
Name:
BDBM21453
Synonyms:
(7-methoxycoumarin-4-yl)acetyl-Ala-Pro-Lys(2,4-dinitrophenyl)-OH Mca-Ala-Pro-Lys(Dnp)-OH
Type:
Fluorogenic Substrate
Emp. Form.:
Mol. Mass.:
SMILES:
: