Target
Poly(ADP-ribose) glycohydrolase
Ligand
BDBM371479
Substrate
Meas. Tech.
PARG Assay
IC50
19.0±n/a nM
Citation
 McGonagle, AEJordan, AWaszkowycz, BHutton, CWaddell, IHitchin, JRSmith, KMHamilton, NM 2,4-dioxo-quinazoline-6-sulfonamide derivatives as inhibitors of PARG US Patent  US10239843 Publication Date 3/26/2019 
Target
Name:
Poly(ADP-ribose) glycohydrolase
Synonyms:
PARG Poly(ADP-ribose) glycohydrolase | poly(ADP-ribose) glycohydrolase (PARG)
Type:
Protein
Mol. Mass.:
111107.13
Organism:
Homo sapiens (Human)
Description:
Q86W56
Residue:
976
  
Inhibitor
Name:
BDBM371479
Synonyms:
N-[1-(Fluoromethyl)cyclopropyl]-1-[(3-methylimidazol-4-yl)methyl]-3-[(1-methylpyrazol-4-yl)methyl]-2,4-dioxo-quinazoline-6-sulfonamide | US10239843, Example 588
Type:
Small organic molecule
Emp. Form.:
C22H24FN7O4S
Mol. Mass.:
501.534
SMILES:
Cn1cc(Cn2c(=O)n(Cc3cncn3C)c3ccc(cc3c2=O)S(=O)(=O)NC2(CF)CC2)cn1
: