Target
Lipoxygenase
Ligand
BDBM22352
Substrate
BDBM22231
Meas. Tech.
COX Inhibitor Screening Assay
IC50
400±n/a nM
Citation
 Rao, PNChen, QHKnaus, EE Synthesis and structure-activity relationship studies of 1,3-diarylprop-2-yn-1-ones: dual inhibitors of cyclooxygenases and lipoxygenases. J Med Chem 49:1668-83 (2006)  
Target
Name:
Lipoxygenase
Synonyms:
5-Lipoxygenase | 5-Lipoxygenase (5-LO)
Type:
Enzyme
Mol. Mass.:
97294.59
Organism:
Solanum tuberosum (potato)
Description:
Residue:
864
  
Inhibitor
Name:
BDBM22352
Synonyms:
1,3-Diarylprop-2-yn-1-one, 13i CHEMBL197573
Type:
Small organic molecule
Emp. Form.:
C16H10F2O3S
Mol. Mass.:
320.311
SMILES:
CS(=O)(=O)c1ccc(cc1)C#CC(=O)c1ccc(F)c(F)c1
:
Substrate
Name:
BDBM22231
Synonyms:
(9Z,12Z)-octadeca-9,12-dienoic acid Linoleic Acid | Linoleic acid (LA)
Type:
Unsaturated fatty acid
Emp. Form.:
C18H32O2
Mol. Mass.:
280.4455
SMILES:
CCCCC\C=C/C\C=C/CCCCCCCC(O)=O
: