Target
Seed linoleate 13S-lipoxygenase-1
Ligand
BDBM22354
Substrate
BDBM22231
Meas. Tech.
COX Inhibitor Screening Assay
IC50
320±n/a nM
Citation
 Rao, PNChen, QHKnaus, EE Synthesis and structure-activity relationship studies of 1,3-diarylprop-2-yn-1-ones: dual inhibitors of cyclooxygenases and lipoxygenases. J Med Chem 49:1668-83 (2006)  
Target
Name:
Seed linoleate 13S-lipoxygenase-1
Synonyms:
15-LOX 15-lipo-oxygenase (SLO) L-1 LOX1.1 Lipoxygenase (LOX) Lipoxygenase-1 | Seed lipoxygenase-1
Type:
Enzyme
Mol. Mass.:
94365.66
Organism:
Glycine max (soybean)
Description:
Residue:
839
  
Inhibitor
Name:
BDBM22354
Synonyms:
1,3-Diarylprop-2-yn-1-one, 13k CHEMBL194297
Type:
Small organic molecule
Emp. Form.:
C16H12O4S
Mol. Mass.:
300.329
SMILES:
CS(=O)(=O)c1ccc(cc1)C#CC(=O)c1ccc(O)cc1
:
Substrate
Name:
BDBM22231
Synonyms:
(9Z,12Z)-octadeca-9,12-dienoic acid Linoleic Acid | Linoleic acid (LA)
Type:
Unsaturated fatty acid
Emp. Form.:
C18H32O2
Mol. Mass.:
280.4455
SMILES:
CCCCC\C=C/C\C=C/CCCCCCCC(O)=O
: