Target
Voltage-dependent T-type calcium channel subunit alpha-1H
Ligand
BDBM372637
Substrate
Meas. Tech.
Measurement of Calcium Channel Flux by Means of FLIPR Assay
IC50
11.0±n/a nM
Citation
 Bezencon, OGatfield, JHeidmann, BSiegrist, RStamm, S Triazole compounds as T-type calcium channel blockers US Patent  US10246426 Publication Date 4/2/2019 
Target
Name:
Voltage-dependent T-type calcium channel subunit alpha-1H
Synonyms:
CAC1H_HUMAN Low-voltage-activated calcium channel alpha1 3.2 subunit Voltage-gated calcium channel voltage-dependent T-type calcium channel subunit alpha-1H isoform a
Type:
Enzyme Catalytic Domain
Mol. Mass.:
259187.68
Organism:
Homo sapiens (Human)
Description:
Calcium channel (Type T,L) 0 0::O95180
Residue:
2353
  
Inhibitor
Name:
BDBM372637
Synonyms:
2-(1,3-Dimethyl-1H-indazol-5-yl)-N-[2-(3-fluoro-4-trifluoromethoxy-benzyl)-2H-[1,2,3]triazol-4-yl]-acetamide | US10246426, Example 191
Type:
Small organic molecule
Emp. Form.:
C21H18F4N6O2
Mol. Mass.:
462.4002
SMILES:
Cc1nn(C)c2ccc(CC(=O)Nc3cnn(Cc4ccc(OC(F)(F)F)c(F)c4)n3)cc12
: