Target
Liver carboxylesterase 1
Ligand
BDBM22795
Substrate
BDBM22723
Meas. Tech.
Enzyme Inhibition Assay
Ki
750±n/a nM
Citation
 Hyatt, JLMoak, THatfield, MJTsurkan, LEdwards, CCWierdl, MDanks, MKWadkins, RMPotter, PM Selective inhibition of carboxylesterases by isatins, indole-2,3-diones. J Med Chem 50:1876-85 (2007)  
Target
Name:
Liver carboxylesterase 1
Synonyms:
Carboxylesterase 1 liver carboxylesterase 1 | rCE
Type:
Enzyme
Mol. Mass.:
62292
Organism:
Oryctolagus cuniculus (rabbit)
Description:
Residue:
565
  
Inhibitor
Name:
BDBM22795
Synonyms:
1-[(4-chlorophenyl)methyl]-2,3-dihydro-1H-indole-2,3-dione | Isatin-based compound, 15
Type:
Small organic molecule
Emp. Form.:
C15H10ClNO2
Mol. Mass.:
271.698
SMILES:
Clc1ccc(CN2C(=O)C(=O)c3ccccc23)cc1
:
Substrate
Name:
BDBM22723
Synonyms:
2-nitrophenyl acetate o-NPA | o-nitrophenyl acetate
Type:
Small organic molecule
Emp. Form.:
C8H7NO4
Mol. Mass.:
181.1455
SMILES:
CC(=O)Oc1ccccc1[N+]([O-])=O
: