Target
Adenosine deaminase
Ligand
BDBM22918
Substrate
BDBM14487
Meas. Tech.
ADA Inhibition Assay
pH
7.4±n/a
Temperature
295.15±n/a K
Ki
1200±n/a nM
Citation
 Terasaka, TKinoshita, TKuno, MNakanishi, I A highly potent non-nucleoside adenosine deaminase inhibitor: efficient drug discovery by intentional lead hybridization. J Am Chem Soc 126:34-5 (2004)  
Target
Name:
Adenosine deaminase
Synonyms:
ADA ADA_HUMAN | Adenosine aminohydrolase
Type:
Enzyme
Mol. Mass.:
40759.44
Organism:
Homo sapiens (Human)
Description:
Human recombinant ADA was expressed and purified from an ADA-deficient bacterial strain.
Residue:
363
  
Inhibitor
Name:
BDBM22918
Synonyms:
2-(4-{5-[(1H-1,3-benzodiazol-2-ylamino)methyl]thiophen-2-yl}-1,3-thiazol-2-yl)guanidine | FR117016
Type:
Small organic molecule
Emp. Form.:
C16H15N7S2
Mol. Mass.:
369.467
SMILES:
NC(N)=Nc1nc(cs1)-c1ccc(CNc2nc3ccccc3[nH]2)s1
:
Substrate
Name:
BDBM14487
Synonyms:
(2R,3R,4S,5R)-2-(6-amino-9H-purin-9-yl)-5-(hydroxymethyl)oxolane-3,4-diol Adenosine N6-Methylado cid_191 | cid_60961
Type:
Nucleoside or nucleotide
Emp. Form.:
C10H13N5O4
Mol. Mass.:
267.2413
SMILES:
Nc1ncnc2n(cnc12)[C@@H]1O[C@H](CO)[C@@H](O)[C@H]1O
: