Target
L-lactate dehydrogenase
Ligand
BDBM23248
Substrate
BDBM23233
Meas. Tech.
Lactate Dehydrogenase Inhibition Assay
pH
7.5±n/a
Temperature
298.15±n/a K
IC50
>100000±n/a nM
Citation
 Cameron, ARead, JTranter, RWinter, VJSessions, RBBrady, RLVivas, LEaston, AKendrick, HCroft, SLBarros, DLavandera, JLMartin, JJRisco, FGarcía-Ochoa, SGamo, FJSanz, LLeon, LRuiz, JRGabarró, RMallo, AGómez de las Heras, F Identification and activity of a series of azole-based compounds with lactate dehydrogenase-directed anti-malarial activity. J Biol Chem 279:31429-39 (2004)  
Target
Name:
L-lactate dehydrogenase
Synonyms:
L-lactate dehydrogenase Lactate Dehydrogenase | pfLDH
Type:
Oxidoreductase
Mol. Mass.:
34111.90
Organism:
Plasmodium falciparum
Description:
Residue:
316
  
Inhibitor
Name:
BDBM23248
Synonyms:
1,2(1,5)-Isoxazole, IOA7 | methyl 5-hydroxy-3-methyl-1,2-oxazole-4-carboxylate
Type:
Small organic molecule
Emp. Form.:
C6H7NO4
Mol. Mass.:
157.1241
SMILES:
COC(=O)c1c(C)[nH]oc1=O
:
Substrate
Name:
BDBM23233
Synonyms:
2-hydroxypropanoic acid Lactic Acid
Type:
Small organic molecule
Emp. Form.:
C3H6O3
Mol. Mass.:
90.0779
SMILES:
CC(O)C(O)=O
: