Target
L-lactate dehydrogenase
Ligand
BDBM23252
Substrate
BDBM23233
Meas. Tech.
Lactate Dehydrogenase Inhibition Assay
pH
7.5±n/a
Temperature
298.15±n/a K
IC50
>100000±n/a nM
Citation
 Cameron, ARead, JTranter, RWinter, VJSessions, RBBrady, RLVivas, LEaston, AKendrick, HCroft, SLBarros, DLavandera, JLMartin, JJRisco, FGarcía-Ochoa, SGamo, FJSanz, LLeon, LRuiz, JRGabarró, RMallo, AGómez de las Heras, F Identification and activity of a series of azole-based compounds with lactate dehydrogenase-directed anti-malarial activity. J Biol Chem 279:31429-39 (2004)  
Target
Name:
L-lactate dehydrogenase
Synonyms:
L-lactate dehydrogenase Lactate Dehydrogenase | pfLDH
Type:
Oxidoreductase
Mol. Mass.:
34111.90
Organism:
Plasmodium falciparum
Description:
Residue:
316
  
Inhibitor
Name:
BDBM23252
Synonyms:
1,2,5-Thiadiazole, TDA2 | 4-amino-1,2,5-thiadiazole-3-carboxylic acid
Type:
Small organic molecule
Emp. Form.:
C3H3N3O2S
Mol. Mass.:
145.14
SMILES:
Nc1nsnc1C(O)=O
:
Substrate
Name:
BDBM23233
Synonyms:
2-hydroxypropanoic acid Lactic Acid
Type:
Small organic molecule
Emp. Form.:
C3H6O3
Mol. Mass.:
90.0779
SMILES:
CC(O)C(O)=O
: