Target
A disintegrin and metalloproteinase with thrombospondin motifs 5 [262-930,L692P]
Ligand
BDBM24000
Substrate
BDBM23993
Meas. Tech.
ADAMTS-5 Inhibition Assay
pH
7.5±n/a
Temperature
303.15±n/a K
IC50
1900±n/a nM
Citation
 Bursavich, MGGilbert, AMLombardi, SGeorgiadis, KEReifenberg, EFlannery, CRMorris, EA 5'-Phenyl-3'H-spiro[indoline-3,2'-[1,3,4]thiadiazol]-2-one inhibitors of ADAMTS-5 (aggrecanase-2). Bioorg Med Chem Lett 17:5630-3 (2007)  
Target
Name:
A disintegrin and metalloproteinase with thrombospondin motifs 5 [262-930,L692P]
Synonyms:
A disintegrin and metalloproteinase with thrombospondin motifs 5 ADAMTS-5 (Aggrecanase-2) ADAMTS5 ADMP2 | ATS5_HUMAN
Type:
Metalloprotease
Mol. Mass.:
73728.14
Organism:
Homo sapiens (Human)
Description:
Q9UNA0[262-930,L692P]
Residue:
669
  
Inhibitor
Name:
BDBM24000
Synonyms:
5-ethyl-5'-(4-methylphenyl)-1,2-dihydro-3'H-spiro[indole-3,2'-[1,3,4]thiadiazole]-2-one | thiadiazole derivative, 15
Type:
Small organic molecule
Emp. Form.:
C18H17N3OS
Mol. Mass.:
323.412
SMILES:
CCc1ccc2NC(=O)C3(NN=C(S3)c3ccc(C)cc3)c2c1
:
Substrate
Name:
BDBM23993
Synonyms:
Peptide contains an aggrecanase cleavage site | QF-peptide
Type:
Fluorescent peptide substrate
Emp. Form.:
Mol. Mass.:
SMILES:
: