Target
A disintegrin and metalloproteinase with thrombospondin motifs 5 [262-930,L692P]
Ligand
BDBM24019
Substrate
BDBM23993
Meas. Tech.
ADAMTS-5 Inhibition Assay
IC50
610±n/a nM
Citation
 Bursavich, MGGilbert, AMLombardi, SGeorgiadis, KEReifenberg, EFlannery, CRMorris, EA 5'-Phenyl-3'H-spiro[indoline-3,2'-[1,3,4]thiadiazol]-2-one inhibitors of ADAMTS-5 (aggrecanase-2). Bioorg Med Chem Lett 17:5630-3 (2007)  
Target
Name:
A disintegrin and metalloproteinase with thrombospondin motifs 5 [262-930,L692P]
Synonyms:
A disintegrin and metalloproteinase with thrombospondin motifs 5 ADAMTS-5 (Aggrecanase-2) ADAMTS5 ADMP2 | ATS5_HUMAN
Type:
Metalloprotease
Mol. Mass.:
73728.14
Organism:
Homo sapiens (Human)
Description:
Q9UNA0[262-930,L692P]
Residue:
669
  
Inhibitor
Name:
BDBM24019
Synonyms:
1-benzyl-5-methyl-5'-(4-methylphenyl)-1,2-dihydro-3'H-spiro[indole-3,2'-[1,3,4]thiadiazole]-2-one | thiadiazole derivative, 31
Type:
Small organic molecule
Emp. Form.:
C24H21N3OS
Mol. Mass.:
399.508
SMILES:
Cc1ccc(cc1)C1=NNC2(S1)C(=O)N(Cc1ccccc1)c1ccc(C)cc21
:
Substrate
Name:
BDBM23993
Synonyms:
Peptide contains an aggrecanase cleavage site | QF-peptide
Type:
Fluorescent peptide substrate
Emp. Form.:
Mol. Mass.:
SMILES:
: