Target
Hepatocyte growth factor receptor
Ligand
BDBM24512
Substrate
poly(Glu4, Tyr)
Meas. Tech.
In Vitro Kinase Assay
pH
7.5±n/a
Temperature
303.15±n/a K
IC50
63±n/a nM
Citation
 Claridge, SRaeppel, FGranger, MCBernstein, NSaavedra, OZhan, LLlewellyn, DWahhab, ADeziel, RRahil, JBeaulieu, NNguyen, HDupont, IBarsalou, ABeaulieu, CChute, IGravel, SRobert, MFLefebvre, SDubay, MPascal, RGillespie, JJin, ZWang, JBesterman, JMMacLeod, ARVaisburg, A Discovery of a novel and potent series of thieno[3,2-b]pyridine-based inhibitors of c-Met and VEGFR2 tyrosine kinases. Bioorg Med Chem Lett 18:2793-8 (2008)  
Target
Name:
Hepatocyte growth factor receptor
Synonyms:
Hepatocyte growth factor receptor Hepatocyte growth factor receptor (c-MET) MET Met proto-oncogene (hepatocyte growth factor receptor) Tyrosine-protein kinase Met (c-Met) c-Met kinase
Type:
Protein
Mol. Mass.:
155559.73
Organism:
Homo sapiens (Human)
Description:
P08581
Residue:
1390
  
Inhibitor
Name:
BDBM24512
Synonyms:
3-(3-fluoro-4-{[2-(pyrimidin-5-yl)thieno[3,2-b]pyridin-7-yl]oxy}phenyl)-1-(2-phenylacetyl)thiourea | thieno[3,2-b]pyridine-based inhibitor, 10o
Type:
Small organic molecule
Emp. Form.:
C26H18FN5O2S2
Mol. Mass.:
515.582
SMILES:
Fc1cc(NC(=S)NC(=O)Cc2ccccc2)ccc1Oc1ccnc2cc(sc12)-c1cncnc1
:
Substrate
Name:
poly(Glu4, Tyr)
Synonyms:
Type:
Random copolymer
Mol. Mass.:
358.43
Organism:
Description:
Residue:
3
NA