Target
Tyrosine-protein phosphatase non-receptor type 11
Ligand
BDBM24516
Substrate
BDBM24514
Meas. Tech.
SHP-2 Inhibition Assay
pH
7±n/a
Temperature
298.15±n/a K
Ki
11700±n/a nM
Citation
 Geronikaki, AEleftheriou, PVicini, PAlam, IDixit, ASaxena, AK 2-Thiazolylimino/heteroarylimino-5-arylidene-4-thiazolidinones as new agents with SHP-2 inhibitory action. J Med Chem 51:5221-8 (2008)  
Target
Name:
Tyrosine-protein phosphatase non-receptor type 11
Synonyms:
PTN11_HUMAN PTP-2C PTPN11 Protein tyrosine phosphatase (PTP) Shp2 Protein-tyrosine phosphatase 2C SHP2 Src homology phosphatase 2 (SHP-2) Tyrosine-protein phosphatase non-receptor type 11 (PTPN11) Tyrosine-protein phosphatase non-receptor type 11 (SHP2)
Type:
Protein phosphatase
Mol. Mass.:
68443.59
Organism:
Homo sapiens (Human)
Description:
Q06124
Residue:
597
  
Inhibitor
Name:
BDBM24516
Synonyms:
(2E,5E)-5-[(4-methoxyphenyl)methylidene]-2-(1,3-thiazol-2-ylimino)-1,3-thiazolidin-4-one | Thiazole analogue, 3
Type:
Small organic molecule
Emp. Form.:
C14H11N3O2S2
Mol. Mass.:
317.386
SMILES:
COc1ccc(\C=C2\S\C(NC2=O)=N\c2nccs2)cc1
:
Substrate
Name:
BDBM24514
Synonyms:
4-nitrophenoxyphosphonic acid CHEMBL24231 | p-nitrophenyl phosphate
Type:
Small organic molecule
Emp. Form.:
C6H6NO6P
Mol. Mass.:
219.0887
SMILES:
OP(O)(=O)Oc1ccc(cc1)[N+]([O-])=O
: