Target
Transthyretin
Ligand
BDBM85507
Substrate
Meas. Tech.
Determination of Binding Constants of HITS to TTR
Kd
592±146.6 nM
Citation
 Graef, IAAlhamadsheh, MM Identification of stabilizers of multimeric proteins US Patent  US10278929 Publication Date 5/7/2019 
Target
Name:
Transthyretin
Synonyms:
ATTR Prealbumin TTHY_HUMAN Transthyretin (TTR)
Type:
Enzyme
Mol. Mass.:
15884.31
Organism:
Homo sapiens (Human)
Description:
P02766
Residue:
147
  
Inhibitor
Name:
BDBM85507
Synonyms:
CAS_4394-00-7 Niflumic acid US10278929, Niflumic acid US20240002326, Compound Niflumic acid
Type:
Small organic molecule
Emp. Form.:
C13H9F3N2O2
Mol. Mass.:
282.218
SMILES:
OC(=O)c1cccnc1Nc1cccc(c1)C(F)(F)F
: